Target
Neutrophil elastase
Ligand
BDBM251834
Substrate
US9475779, MeOSuc-Ala-Ala-Pro-Val-AMC
Meas. Tech.
Human Neutrophil Elastase Assay
pH
7.5±n/a
Temperature
298.15±n/a K
IC50
103±n/a nM
Comments
extracted
Citation
 Oost, TAnderskewitz, RGnamm, CHoesch, HMorschhaeuser, GPeters, SRies, UJ Substituted bicyclic dihydropyrimidinones and their use as inhibitors of neutrophil elastase activity US Patent  US9475779 Publication Date 10/25/2016 
Target
Name:
Neutrophil elastase
Synonyms:
Bone marrow serine protease Coagulation factor X ELANE Elastase HLE Leukocyte elastase Medullasin Neutrophil elastase (HNE) PMN elastase Trypsin
Type:
Enzyme
Mol. Mass.:
28532.38
Organism:
Homo sapiens (Human)
Description:
P08246
Residue:
267
  
Inhibitor
Name:
BDBM251834
Synonyms:
US9475779, D.2.4
Type:
Small organic molecule
Emp. Form.:
C20H15ClN4O4S
Mol. Mass.:
442.876
SMILES:
CS(=O)(=O)c1cc(ccc1C1NC(=O)N(C2=C1C(=O)CC2)c1cncc(Cl)c1)C#N
:
Substrate
Name:
BDBM211682
Synonyms:
US9290457, MeOSuc-AAPV-AMC
Type:
Substrate
Emp. Form.:
C31H41N5O9
Mol. Mass.:
627.6853
SMILES:
COC(=O)CCC(=O)NC(C)C(=O)NC(C)C(=O)N1CCCC1C(=O)NC(C(C)C)C(=O)Nc1ccc2c(C)cc(=O)oc2c1
: