Target
Complement factor B
Ligand
BDBM251874
Substrate
Meas. Tech.
Biological Assay
pH
7.4±n/a
Temperature
298.15±n/a K
IC50
30±n/a nM
Comments
extracted
Citation
 Adams, CMBabu, CCapparelli, MPDing, JEhara, TJendza, KJi, NKarki, RGKawanami, TXue, LMainolfi, NPowers, JJSerrano-Wu, MHZhang, C Complement factor B inhibitors and uses there of US Patent  US9475806 Publication Date 10/25/2016 
Target
Name:
Complement factor B
Synonyms:
BF CFAB_HUMAN | CFB
Type:
Enzyme
Mol. Mass.:
85537.97
Organism:
Homo sapiens (Human)
Description:
P00751
Residue:
764
  
Inhibitor
Name:
BDBM251874
Synonyms:
US9475806, 8-B b) (-)
Type:
Small organic molecule
Emp. Form.:
C20H19N5O2
Mol. Mass.:
361.3972
SMILES:
COc1cc(C)c2[nH]ccc2c1C(C)(OC)c1nc2cc(cnc2[nH]1)C#N
: