Target
Coagulation factor XI
Ligand
BDBM251892
Substrate
Meas. Tech.
Inhibition Assay
pH
7.4±n/a
Temperature
295.15±n/a K
IC50
420±n/a nM
Comments
extracted
Citation
 Röhrig, SHillisch, AStraβburger, JHeitmeier, SSchmidt, MVSchlemmer, KBuchmüller, AGerdes, CTeller, HSchäfer, MTersteegen, A Substituted oxopyridine derivatives and use thereof as factor xia/plasma US Patent  US9475809 Publication Date 10/25/2016 
Target
Name:
Coagulation factor XI
Synonyms:
Coagulation factor XIa Coagulation factor XIa light chain FA11_HUMAN Factor XIa PTA | Plasma thromboplastin antecedent
Type:
Enzyme
Mol. Mass.:
70130.58
Organism:
Homo sapiens (Human)
Description:
P03951
Residue:
625
  
Inhibitor
Name:
BDBM251892
Synonyms:
US9475809, 4 | US9918969, 4
Type:
Small organic molecule
Emp. Form.:
C23H16Cl2N2O5
Mol. Mass.:
471.29
SMILES:
OC(=O)c1ccc(NC(=O)Cn2c3CCC(=O)c3c(cc2=O)-c2cc(Cl)ccc2Cl)cc1
: