Target
Coagulation factor XI
Ligand
BDBM251893
Substrate
Meas. Tech.
Inhibition Assay
pH
7.4±n/a
Temperature
295.15±n/a K
IC50
330±n/a nM
Comments
extracted
Citation
 Röhrig, SHillisch, AStraβburger, JHeitmeier, SSchmidt, MVSchlemmer, KBuchmüller, AGerdes, CTeller, HSchäfer, MTersteegen, A Substituted oxopyridine derivatives and use thereof as factor xia/plasma US Patent  US9475809 Publication Date 10/25/2016 
Target
Name:
Coagulation factor XI
Synonyms:
Coagulation factor XIa Coagulation factor XIa light chain FA11_HUMAN Factor XIa PTA | Plasma thromboplastin antecedent
Type:
Enzyme
Mol. Mass.:
70130.58
Organism:
Homo sapiens (Human)
Description:
P03951
Residue:
625
  
Inhibitor
Name:
BDBM251893
Synonyms:
US9475809, 5 | US9918969, 5
Type:
Small organic molecule
Emp. Form.:
C24H16Cl2N4O5
Mol. Mass.:
511.314
SMILES:
Clc1ccc(Cl)c(c1)-c1cc(=O)n(CC(=O)Nc2ccc(cc2)-c2noc(=O)[nH]2)c2CCC(=O)c12
: