Target
Neuromedin-K receptor
Ligand
BDBM251920
Substrate
Meas. Tech.
Aequorin Functional Assay
IC50
11±n/a nM
Citation
 Hoveyda, HRDutheuil, GFraser, GLRoy, MEl Bousmaqui, MBatt, F Chiral N-acyl-5,6,7(8-substituted)-tetrahydro-[1,2,4]triazolo[4,3-a]pyrazines as selective NK-3 receptor antagonists, pharmaceutical composition, methods for use in NK-3 receptor mediated disorders and chiral synthesis thereof US Patent  US9475814 Publication Date 10/25/2016 
Target
Name:
Neuromedin-K receptor
Synonyms:
NK-3 receptor NK3R NKR Neurokinin B receptor Neuromedin-3 receptor (NK-3R) Neuromedin-K receptor Neuromedin-K receptor (NK3) TAC3R Tachykinin receptor 3 | Tachykinin receptor 3 (NK3)
Type:
Enzyme
Mol. Mass.:
52221.96
Organism:
Homo sapiens (Human)
Description:
P29371
Residue:
465
  
Inhibitor
Name:
BDBM251920
Synonyms:
US10065961, Compound 20 US10941151, Compound 20 | US9475814, 20
Type:
Small organic molecule
Emp. Form.:
C23H21N5OS
Mol. Mass.:
415.511
SMILES:
C[C@H]1N(CCn2c1nnc2-c1nc(C)cs1)C(=O)c1ccc(cc1)-c1ccccc1
: