Target
Rho-associated protein kinase 2
Ligand
BDBM252153
Substrate
Meas. Tech.
In Vitro Assay
pH
7.5±n/a
IC50
1.09±n/a nM
Comments
extracted
Citation
 Quan, MLHu, ZWang, CGlunz, PW Phenylpyrazole derivatives as potent ROCK1 and ROCK2 inhibitors US Patent  US9458110 Publication Date 10/4/2016 
Target
Name:
Rho-associated protein kinase 2
Synonyms:
KIAA0619 ROCK2 Rho kinase 2 (ROCKII) Rho-associated protein kinase 2 (ROCK2) Rho-associated protein kinase 2/Transforming protein RhoA Rho-associated, coiled-coil-containing protein kinase II p164 ROCK-2
Type:
Protein
Mol. Mass.:
160885.43
Organism:
Homo sapiens (Human)
Description:
O75116
Residue:
1388
  
Inhibitor
Name:
BDBM252153
Synonyms:
US9458110, 225
Type:
Small organic molecule
Emp. Form.:
C20H21N3O4
Mol. Mass.:
367.3984
SMILES:
COc1cc(ccc1C(=O)N[C@H]([C@H](O)CO)c1ccccc1)-c1cn[nH]c1
: