Target
Nicotinamide phosphoribosyltransferase
Ligand
BDBM50060813
Substrate
Meas. Tech.
Biochemical Inhibition Assay
pH
7.5±n/a
IC50
5.6±n/a nM
Comments
extracted
Citation
 Bair, KWBaumeister, TRDragovich, PGosselin, FYuen, PZak, MZheng, X Pyridinyl and pyrimidinyl sulfoxide and sulfone derivatives US Patent  US9458172 Publication Date 10/4/2016 
Target
Name:
Nicotinamide phosphoribosyltransferase
Synonyms:
NAMPT NAmPRTase Nicotinamide phosphoribosyltransferase (NAMPT) PBEF1 | Pre-B-cell colony-enhancing factor 1
Type:
Enzyme
Mol. Mass.:
55524.98
Organism:
Homo sapiens (Human)
Description:
P43490
Residue:
491
  
Inhibitor
Name:
BDBM50060813
Synonyms:
CHEMBL3394734 | US9458172, 5
Type:
Small organic molecule
Emp. Form.:
C20H13F2N3O4S
Mol. Mass.:
429.397
SMILES:
Fc1cc(F)cc(c1)S(=O)(=O)c1ccc(CNC(=O)c2cc3ccncc3o2)nc1
: