Target
Nicotinamide phosphoribosyltransferase
Ligand
BDBM252448
Substrate
Meas. Tech.
Biochemical Inhibition Assay
pH
7.5±n/a
IC50
4.7±n/a nM
Comments
extracted
Citation
 Bair, KWBaumeister, TRDragovich, PGosselin, FYuen, PZak, MZheng, X Pyridinyl and pyrimidinyl sulfoxide and sulfone derivatives US Patent  US9458172 Publication Date 10/4/2016 
Target
Name:
Nicotinamide phosphoribosyltransferase
Synonyms:
NAMPT NAmPRTase Nicotinamide phosphoribosyltransferase (NAMPT) PBEF1 | Pre-B-cell colony-enhancing factor 1
Type:
Enzyme
Mol. Mass.:
55524.98
Organism:
Homo sapiens (Human)
Description:
P43490
Residue:
491
  
Inhibitor
Name:
BDBM252448
Synonyms:
US9458172, 18
Type:
Small organic molecule
Emp. Form.:
C20H14F3N5O3S
Mol. Mass.:
461.417
SMILES:
FC(F)(F)c1cccc(c1)S(=O)(=O)c1ccc(CNC(=O)c2cnc3nccn3c2)nc1
: