Target
Nicotinamide phosphoribosyltransferase
Ligand
BDBM252468
Substrate
Meas. Tech.
Biochemical Inhibition Assay
pH
7.5±n/a
IC50
2.8±n/a nM
Comments
extracted
Citation
 Bair, KWBaumeister, TRDragovich, PGosselin, FYuen, PZak, MZheng, X Pyridinyl and pyrimidinyl sulfoxide and sulfone derivatives US Patent  US9458172 Publication Date 10/4/2016 
Target
Name:
Nicotinamide phosphoribosyltransferase
Synonyms:
NAMPT NAmPRTase Nicotinamide phosphoribosyltransferase (NAMPT) PBEF1 | Pre-B-cell colony-enhancing factor 1
Type:
Enzyme
Mol. Mass.:
55524.98
Organism:
Homo sapiens (Human)
Description:
P43490
Residue:
491
  
Inhibitor
Name:
BDBM252468
Synonyms:
US9458172, 39
Type:
Small organic molecule
Emp. Form.:
C24H22N4O4S2
Mol. Mass.:
494.586
SMILES:
O=C(NCc1ccc(cn1)S(=O)(=O)c1ccc(cc1)N1CCOCC1)c1cc2ccncc2s1
: