Target
Nicotinamide phosphoribosyltransferase
Ligand
BDBM252504
Substrate
Meas. Tech.
Biochemical Inhibition Assay
pH
7.5±n/a
IC50
27.8±n/a nM
Comments
extracted
Citation
 Bair, KWBaumeister, TRDragovich, PGosselin, FYuen, PZak, MZheng, X Pyridinyl and pyrimidinyl sulfoxide and sulfone derivatives US Patent  US9458172 Publication Date 10/4/2016 
Target
Name:
Nicotinamide phosphoribosyltransferase
Synonyms:
NAMPT NAmPRTase Nicotinamide phosphoribosyltransferase (NAMPT) PBEF1 | Pre-B-cell colony-enhancing factor 1
Type:
Enzyme
Mol. Mass.:
55524.98
Organism:
Homo sapiens (Human)
Description:
P43490
Residue:
491
  
Inhibitor
Name:
BDBM252504
Synonyms:
US9458172, 84
Type:
Small organic molecule
Emp. Form.:
C20H19N7O3S
Mol. Mass.:
437.475
SMILES:
CN(C)c1ccc(cn1)S(=O)(=O)c1ccc(CNC(=O)c2cnc3[nH]ncc3c2)nc1
: