Target
Nicotinamide phosphoribosyltransferase
Ligand
BDBM252518
Substrate
Meas. Tech.
Biochemical Inhibition Assay
pH
7.5±n/a
IC50
54.7±n/a nM
Comments
extracted
Citation
 Bair, KWBaumeister, TRDragovich, PGosselin, FYuen, PZak, MZheng, X Pyridinyl and pyrimidinyl sulfoxide and sulfone derivatives US Patent  US9458172 Publication Date 10/4/2016 
Target
Name:
Nicotinamide phosphoribosyltransferase
Synonyms:
NAMPT NAmPRTase Nicotinamide phosphoribosyltransferase (NAMPT) PBEF1 | Pre-B-cell colony-enhancing factor 1
Type:
Enzyme
Mol. Mass.:
55524.98
Organism:
Homo sapiens (Human)
Description:
P43490
Residue:
491
  
Inhibitor
Name:
BDBM252518
Synonyms:
US9458172, 99
Type:
Small organic molecule
Emp. Form.:
C18H18N6O3S
Mol. Mass.:
398.439
SMILES:
Cn1cc(cn1)S(=O)(=O)c1ccc(CNC(=O)N2Cc3ccncc3C2)nc1
: