Target
Nicotinamide phosphoribosyltransferase
Ligand
BDBM252550
Substrate
Meas. Tech.
Biochemical Inhibition Assay
pH
7.5±n/a
IC50
5.24±n/a nM
Comments
extracted
Citation
 Bair, KWBaumeister, TRDragovich, PGosselin, FYuen, PZak, MZheng, X Pyridinyl and pyrimidinyl sulfoxide and sulfone derivatives US Patent  US9458172 Publication Date 10/4/2016 
Target
Name:
Nicotinamide phosphoribosyltransferase
Synonyms:
NAMPT NAmPRTase Nicotinamide phosphoribosyltransferase (NAMPT) PBEF1 | Pre-B-cell colony-enhancing factor 1
Type:
Enzyme
Mol. Mass.:
55524.98
Organism:
Homo sapiens (Human)
Description:
P43490
Residue:
491
  
Inhibitor
Name:
BDBM252550
Synonyms:
US9458172, 131
Type:
Small organic molecule
Emp. Form.:
C21H21F3N4O4S
Mol. Mass.:
482.476
SMILES:
FC(F)(F)CN1CCC(CC1)S(=O)(=O)c1ccc(CNC(=O)c2cc3ccncc3o2)nc1
: