Target
Nicotinamide phosphoribosyltransferase
Ligand
BDBM252586
Substrate
Meas. Tech.
Biochemical Inhibition Assay
pH
7.5±n/a
IC50
23±n/a nM
Comments
extracted
Citation
 Bair, KWBaumeister, TRDragovich, PGosselin, FYuen, PZak, MZheng, X Pyridinyl and pyrimidinyl sulfoxide and sulfone derivatives US Patent  US9458172 Publication Date 10/4/2016 
Target
Name:
Nicotinamide phosphoribosyltransferase
Synonyms:
NAMPT NAmPRTase Nicotinamide phosphoribosyltransferase (NAMPT) PBEF1 | Pre-B-cell colony-enhancing factor 1
Type:
Enzyme
Mol. Mass.:
55524.98
Organism:
Homo sapiens (Human)
Description:
P43490
Residue:
491
  
Inhibitor
Name:
BDBM252586
Synonyms:
US9458172, 167
Type:
Small organic molecule
Emp. Form.:
C22H21N7O4S
Mol. Mass.:
479.512
SMILES:
O=C(NCc1ccc(cn1)S(=O)(=O)c1cnc(nc1)N1CCOCC1)c1ccc2nccn2c1
: