Target
Metabotropic glutamate receptor 2
Ligand
BDBM252764
Substrate
Meas. Tech.
[35S]GTPgammaS Binding Assay
Temperature
298.15±n/a K
IC50
4.0±n/a nM
Comments
extracted
Citation
 Takaishi, MSato, NShibuguchi, TMotoki, TTakahashi, YSasaki, TBraunton, A Tetrahydroimidazo(1,5-D)[1,4]oxazepine derivative US Patent  US9458176 Publication Date 10/4/2016 
Target
Name:
Metabotropic glutamate receptor 2
Synonyms:
GPRC1B GRM2_HUMAN Metabotropic glutamate receptor mGlu2 | metabotropic glutamate 2
Type:
Enzyme
Mol. Mass.:
95584.88
Organism:
Homo sapiens (Human)
Description:
Q14416
Residue:
872
  
Inhibitor
Name:
BDBM252764
Synonyms:
US9458176, 161
Type:
Small organic molecule
Emp. Form.:
C23H23F4N3O2
Mol. Mass.:
449.4412
SMILES:
Cc1cc(cc(C)n1)-c1nc(-c2ccc(OC(F)(F)F)c(C)c2)n2C[C@@H](CF)OCCc12
: