Target
Isoform PDE10A2 of cAMP and cAMP-inhibited cGMP 3',5'-cyclic phosphodiesterase 10A (PDE10A2)
Ligand
BDBM252869
Substrate
Meas. Tech.
Activity Assay
pH
7.5±n/a
Temperature
277.15±n/a K
IC50
0.67±n/a nM
Comments
extracted
Citation
 Inoue, HKawamoto, YKamei, KHiramatsu, KTomino, M Benzothiophene derivative US Patent  US9464076 Publication Date 10/11/2016 
Target
Name:
Isoform PDE10A2 of cAMP and cAMP-inhibited cGMP 3',5'-cyclic phosphodiesterase 10A (PDE10A2)
Synonyms:
PDE10A Phosphodiesterase 10A Phosphodiesterase 10A2 cAMP and cAMP-inhibited cGMP 3',5'-cyclic phosphodiesterase 10A (PDE10A2)
Type:
Enzyme
Mol. Mass.:
89387.03
Organism:
Homo sapiens (Human)
Description:
Q9Y233-2
Residue:
789
  
Inhibitor
Name:
BDBM252869
Synonyms:
US9464076, 21
Type:
Small organic molecule
Emp. Form.:
C27H26N2O3S
Mol. Mass.:
458.572
SMILES:
Cc1c(sc2c(cccc12)C(=O)C1CCC1)C(=O)Nc1cc(c2ccccc2n1)C(C)(C)O
: