Target
Isoform PDE10A2 of cAMP and cAMP-inhibited cGMP 3',5'-cyclic phosphodiesterase 10A (PDE10A2)
Ligand
BDBM252896
Substrate
Meas. Tech.
Activity Assay
pH
7.5±n/a
Temperature
277.15±n/a K
IC50
0.85±n/a nM
Comments
extracted
Citation
 Inoue, HKawamoto, YKamei, KHiramatsu, KTomino, M Benzothiophene derivative US Patent  US9464076 Publication Date 10/11/2016 
Target
Name:
Isoform PDE10A2 of cAMP and cAMP-inhibited cGMP 3',5'-cyclic phosphodiesterase 10A (PDE10A2)
Synonyms:
PDE10A Phosphodiesterase 10A Phosphodiesterase 10A2 cAMP and cAMP-inhibited cGMP 3',5'-cyclic phosphodiesterase 10A (PDE10A2)
Type:
Enzyme
Mol. Mass.:
89387.03
Organism:
Homo sapiens (Human)
Description:
Q9Y233-2
Residue:
789
  
Inhibitor
Name:
BDBM252896
Synonyms:
US9464076, 48
Type:
Small organic molecule
Emp. Form.:
C28H27F2N3O3S
Mol. Mass.:
523.594
SMILES:
COCc1ccc(C(C)=O)c2sc(C(=O)Nc3cc(CN4CCC(F)(F)C4)c4ccccc4n3)c(C)c12
: