Target
Isoform PDE10A2 of cAMP and cAMP-inhibited cGMP 3',5'-cyclic phosphodiesterase 10A (PDE10A2)
Ligand
BDBM252920
Substrate
Meas. Tech.
Activity Assay
pH
7.5±n/a
Temperature
277.15±n/a K
IC50
0.54±n/a nM
Comments
extracted
Citation
 Inoue, HKawamoto, YKamei, KHiramatsu, KTomino, M Benzothiophene derivative US Patent  US9464076 Publication Date 10/11/2016 
Target
Name:
Isoform PDE10A2 of cAMP and cAMP-inhibited cGMP 3',5'-cyclic phosphodiesterase 10A (PDE10A2)
Synonyms:
PDE10A Phosphodiesterase 10A Phosphodiesterase 10A2 cAMP and cAMP-inhibited cGMP 3',5'-cyclic phosphodiesterase 10A (PDE10A2)
Type:
Enzyme
Mol. Mass.:
89387.03
Organism:
Homo sapiens (Human)
Description:
Q9Y233-2
Residue:
789
  
Inhibitor
Name:
BDBM252920
Synonyms:
US9464076, 72
Type:
Small organic molecule
Emp. Form.:
C26H26N2O5S
Mol. Mass.:
478.56
SMILES:
COCc1ccc(C(C)=O)c2sc(C(=O)Nc3ccc4c(COCCO)cccc4n3)c(C)c12
: