Target
Prothrombin
Ligand
BDBM252995
Substrate
Meas. Tech.
In Vitro Assay
pH
7.4±n/a
Ki
9.2±n/a nM
Comments
extracted
Citation
 Chobanian, HBiftu, TPio, BWu, Z Thrombin inhibitors US Patent  US9469608 Publication Date 10/18/2016 
Target
Name:
Prothrombin
Synonyms:
Activation peptide fragment 1 Coagulation factor II Prothrombin precursor Thrombin heavy chain | Thrombin light chain
Type:
Protein
Mol. Mass.:
70029.57
Organism:
Homo sapiens (Human)
Description:
P00734
Residue:
622
  
Inhibitor
Name:
BDBM252995
Synonyms:
US9469608, 24-8
Type:
Small organic molecule
Emp. Form.:
C22H24ClN3O3
Mol. Mass.:
413.897
SMILES:
NCc1ccc(Cl)cc1CNC(=O)[C@@H]1CCCN1C(=O)C1COc2ccccc12
: