Target
Delta-type opioid receptor
Ligand
BDBM50015003
Substrate
Meas. Tech.
Ligand Binding Assay
pH
7.4±n/a
Ki
1.91±n/a nM
Comments
extracted
Citation
 Lewis, JHusbands, S Orvinol and thevinol derivatives useful in the treatment of anxiety or a compulsive disorder US Patent  US9480684 Publication Date 11/1/2016 
Target
Name:
Delta-type opioid receptor
Synonyms:
Cytochrome P450 3A4 Delta opioid receptor Delta-type opioid receptor (DOR) OPRD_RAT Opioid receptor Opioid receptors; mu & delta Ror-a | Voltage-gated potassium channel
Type:
G Protein-Coupled Receptor (GPCR)
Mol. Mass.:
40465.04
Organism:
Rattus norvegicus (rat)
Description:
Competition binding assays were using CHO-K1 cell membranes expressing the opioid receptor.
Residue:
372
  
Inhibitor
Name:
BDBM50015003
Synonyms:
CHEMBL3262089 US9480684, 7a, R = Ph- BU127
Type:
Small organic molecule
Emp. Form.:
C31H37NO4
Mol. Mass.:
487.6298
SMILES:
[H][C@@]12Oc3c4c(C[C@@]5([H])N(CC6CC6)CC[C@@]14[C@@]51CC[C@@]2(OC)[C@]([H])(C1)[C@](C)(O)c1ccccc1)ccc3O
: