Target
cGMP-inhibited 3',5'-cyclic phosphodiesterase 3A
Ligand
BDBM253042
Substrate
Meas. Tech.
Inhibtion Assay
pH
7.5±n/a
Temperature
303.15±n/a K
IC50
>10000±n/a nM
Comments
extracted
Citation
 Cutshall, NSFerguson, KMZuta, CP Optically active PDE10 inhibitor US Patent  US9493447 Publication Date 11/15/2016 
Target
Name:
cGMP-inhibited 3',5'-cyclic phosphodiesterase 3A
Synonyms:
3',5'-cyclic phosphodiesterase Cyclic GMP-inhibited phosphodiesterase A PDE3A_HUMAN Phosphodiesterase 3 (PDE3) Phosphodiesterase 3A Phosphodiesterase 3A (PDE3A1) cGMP-inhibited 3',5'-cyclic phosphodiesterase A | cGMP-inhibited 3,5-cyclic phosphodiesterase A
Type:
Enzyme
Mol. Mass.:
124966.46
Organism:
Homo sapiens (Human)
Description:
Q14432
Residue:
1141
  
Inhibitor
Name:
BDBM253042
Synonyms:
US9493447, 1001
Type:
Small organic molecule
Emp. Form.:
C25H23ClN2O5S
Mol. Mass.:
498.979
SMILES:
CCOC(C(=O)c1ccc(o1)-c1cc(OC)c(Cl)c(OC)c1)c1ccc(cc1)-c1nnc(C)s1
: