Target
Isoform 4 of cAMP-specific 3',5'-cyclic phosphodiesterase 4A (RD1)
Ligand
BDBM253042
Substrate
Meas. Tech.
Inhibtion Assay
pH
7.5±n/a
Temperature
303.15±n/a K
IC50
>10000±n/a nM
Comments
extracted
Citation
 Cutshall, NSFerguson, KMZuta, CP Optically active PDE10 inhibitor US Patent  US9493447 Publication Date 11/15/2016 
Target
Name:
Isoform 4 of cAMP-specific 3',5'-cyclic phosphodiesterase 4A (RD1)
Synonyms:
DPDE2 PDE4A1 Phosphodiesterase 4A (PDE4A1) cAMP-specific 3',5'-cyclic phosphodiesterase 4A (RD1) | cAMP-specific 3',5'-cyclic phosphodiesterase 4A Isoform 4
Type:
Enzyme Catalytic Domain
Mol. Mass.:
72186.86
Organism:
Homo sapiens (Human)
Description:
P27815-4
Residue:
647
  
Inhibitor
Name:
BDBM253042
Synonyms:
US9493447, 1001
Type:
Small organic molecule
Emp. Form.:
C25H23ClN2O5S
Mol. Mass.:
498.979
SMILES:
CCOC(C(=O)c1ccc(o1)-c1cc(OC)c(Cl)c(OC)c1)c1ccc(cc1)-c1nnc(C)s1
: