Target
Nuclear receptor ROR-gamma [262-507]
Ligand
BDBM253075
Substrate
Meas. Tech.
Scintillation Proximity Assay (SPA)
Temperature
298.15±n/a K
IC50
21±n/a nM
Comments
extracted
Citation
 Duan, JDhar, TGJiang, BLu, ZXiao, H Pyrrolidinyl sulfone RORγ modulators US Patent  US9458171 Publication Date 10/4/2016 
Target
Name:
Nuclear receptor ROR-gamma [262-507]
Synonyms:
NR1F3 Nuclear receptor ROR-gamma (aa 262-507) RORC RORG_HUMAN | RZRG
Type:
Enzyme Catalytic Domain
Mol. Mass.:
28605.37
Organism:
Homo sapiens (Human)
Description:
aa 262-507
Residue:
246
  
Inhibitor
Name:
BDBM253075
Synonyms:
US9458171, 34
Type:
Small organic molecule
Emp. Form.:
C21H18F8N2O3S
Mol. Mass.:
530.431
SMILES:
NC(=O)CN1CC[C@](C1)(c1ccc(cc1)C(F)(C(F)(F)F)C(F)(F)F)S(=O)(=O)c1ccc(F)cc1
: