Target
Nuclear receptor ROR-gamma [262-507]
Ligand
BDBM253327
Substrate
Meas. Tech.
Scintillation Proximity Assay (SPA)
Temperature
298.15±n/a K
IC50
26±n/a nM
Comments
extracted
Citation
 Duan, JDhar, TGJiang, BLu, ZXiao, H Pyrrolidinyl sulfone RORγ modulators US Patent  US9458171 Publication Date 10/4/2016 
Target
Name:
Nuclear receptor ROR-gamma [262-507]
Synonyms:
NR1F3 Nuclear receptor ROR-gamma (aa 262-507) RORC RORG_HUMAN | RZRG
Type:
Enzyme Catalytic Domain
Mol. Mass.:
28605.37
Organism:
Homo sapiens (Human)
Description:
aa 262-507
Residue:
246
  
Inhibitor
Name:
BDBM253327
Synonyms:
US9458171, 287
Type:
Small organic molecule
Emp. Form.:
C27H28F7N3O5S
Mol. Mass.:
639.582
SMILES:
COC(c1ccc(cc1)[C@@]1(CCN(C1)C(=O)N1CCN(CC1)C(C)=O)S(=O)(=O)c1ccc(F)cc1)(C(F)(F)F)C(F)(F)F
: