Target
Melanocyte-stimulating hormone receptor
Ligand
BDBM135767
Substrate
Meas. Tech.
cAMP Assay
pH
7.5±n/a
Temperature
310.15±n/a K
EC50
18±n/a nM
Comments
extracted
Citation
 Shi, YSharma, SDDodd, JHYang, W Melanocortin receptor-specific heptapeptides US Patent  US9458201 Publication Date 10/4/2016 
Target
Name:
Melanocyte-stimulating hormone receptor
Synonyms:
MC1-R MSH-R MSHR_HUMAN Melanocortin receptor (M1 and M4) Melanocortin receptor 1 (MC1-R) | Melanocortin receptor 1 (MC1R)
Type:
Enzyme
Mol. Mass.:
34717.23
Organism:
Homo sapiens (Human)
Description:
Q01726
Residue:
317
  
Inhibitor
Name:
BDBM135767
Synonyms:
US10179804, Example 152 US8846601, 152 | US9458201, 152
Type:
Small organic molecule
Emp. Form.:
C49H71N17O10
Mol. Mass.:
1058.1959
SMILES:
CC(=O)N[C@H](CCCNC(N)=N)C(=O)N[C@H]1CCCNC(=O)CC[C@H](NC(=O)[C@H](Cc2c[nH]c3ccccc23)NC(=O)[C@H](CCCNC(N)=N)NC(=O)[C@@H](Cc2ccccc2)NC(=O)[C@H](CCC(N)=O)NC1=O)C(N)=O
: