Target
Taste receptor type 1 member 1/3
Ligand
BDBM253873
Substrate
Meas. Tech.
Immunological Binding Assay
Temperature
283.15±n/a K
EC50
8510±n/a nM
Comments
extracted
Citation
 Li, XStaszewski, LXu, H Use of T1R3 venus flytrap region polypeptide to screen for taste modulators US Patent  US9459250 Publication Date 10/4/2016 
Target
Name:
Taste receptor type 1 member 1/3
Synonyms:
Taste Receptor T1R1/T1R3
Type:
Enzyme
Mol. Mass.:
Description:
Components:
This complex has 2 components.
Component 1
Name:
Taste receptor type 1 member 1
Synonyms:
GPR70 TAS1R1 TS1R1_HUMAN | Taste receptor type 1 member 1 (T1R1)
Type:
Enzyme
Mol. Mass.:
93094.35
Organism:
Homo sapiens (Human)
Description:
Q7RTX1
Residue:
841
  
Component 2
Name:
Taste receptor type 1 member 3
Synonyms:
T1R3 TR3 Taste receptor type 1 member 3 (T1R3)
Type:
Enzyme
Mol. Mass.:
93393.60
Organism:
Homo sapiens (Human)
Description:
Q7RTX0
Residue:
852
  
Inhibitor
Name:
BDBM253873
Synonyms:
US9459250, E78
Type:
Small organic molecule
Emp. Form.:
C11H14Cl2N2OS
Mol. Mass.:
293.213
SMILES:
CC1CCCCC1NC(=O)c1nsc(Cl)c1Cl
: