Target
Prothrombin
Ligand
BDBM162369
Substrate
Meas. Tech.
Thrombin Activity Assay
pH
7.4±n/a
Temperature
298.15±n/a K
IC50
<100±n/a nM
Comments
extracted
Citation
 Short, KMPham, SMWilliams, DCKita, DB Multisubstituted aromatic compounds as serine protease inhibitors US Patent  US9687479 Publication Date 6/27/2017 
Target
Name:
Prothrombin
Synonyms:
Activation peptide fragment 1 Coagulation factor II Prothrombin precursor Thrombin heavy chain | Thrombin light chain
Type:
Protein
Mol. Mass.:
70029.57
Organism:
Homo sapiens (Human)
Description:
P00734
Residue:
622
  
Inhibitor
Name:
BDBM162369
Synonyms:
US9687479, 6 3-(5-[(5-chlorothiophen-2-yl)methyl]amino-1-[(furan-3-yl)carbonyl]-1H-pyrazol-3-yl)-1-(pyridin-4-ylmethyl)-1,2-dihydropyridin-2-one
Type:
Small Organic Molecule
Emp. Form.:
C24H18ClN5O3S
Mol. Mass.:
491.949
SMILES:
Clc1ccsc1CNc1cc(nn1C(=O)c1ccoc1)-c1cccn(Cc2ccncc2)c1=O
: