Target
Kallikrein-1
Ligand
BDBM163403
Substrate
Meas. Tech.
KLK1 Activity Assay
pH
7.5±n/a
Temperature
310.15±n/a K
IC50
55000±n/a nM
Comments
extracted
Citation
 Short, KMPham, SMWilliams, DCKita, DB Multisubstituted aromatic compounds as serine protease inhibitors US Patent  US9687479 Publication Date 6/27/2017 
Target
Name:
Kallikrein-1
Synonyms:
KLK1 Kallikrein 1 Kidney/pancreas/salivary gland kallikrein | Tissue kallikrein
Type:
Enzyme
Mol. Mass.:
28874.69
Organism:
Homo sapiens (Human)
Description:
P06870
Residue:
262
  
Inhibitor
Name:
BDBM163403
Synonyms:
US9687479, 276 1-[(2-aminophenyl)carbonyl]-N-[(5-chlorothiophen-2-yl)methyl]-3-(3-fluoropyridin-2-yl)-1H-pyrazol-5-amine
Type:
Small Organic Molecule
Emp. Form.:
C20H14ClF2N5OS
Mol. Mass.:
445.873
SMILES:
Nc1ccccc1C(=O)n1nc(c(F)c1NCc1ccc(Cl)s1)-c1ncccc1F
: