Target
Kallikrein-1
Ligand
BDBM163407
Substrate
Meas. Tech.
KLK1 Activity Assay
pH
7.5±n/a
Temperature
310.15±n/a K
IC50
55000±n/a nM
Comments
extracted
Citation
 Short, KMPham, SMWilliams, DCKita, DB Multisubstituted aromatic compounds as serine protease inhibitors US Patent  US9687479 Publication Date 6/27/2017 
Target
Name:
Kallikrein-1
Synonyms:
KLK1 Kallikrein 1 Kidney/pancreas/salivary gland kallikrein | Tissue kallikrein
Type:
Enzyme
Mol. Mass.:
28874.69
Organism:
Homo sapiens (Human)
Description:
P06870
Residue:
262
  
Inhibitor
Name:
BDBM163407
Synonyms:
US9687479, 278 1-[(2-methoxyphenyl)carbonyl]-3-(pyridin-2-yl)-N-(thiophen-2-ylmethyl)-1H-pyrazol-5-amine | US9687479, 285 N-[(5-chlorothiophen-2-yl)methyl]-1-[(2-methoxyphenyl)carbonyl]-3-(pyridin-2-yl)-1H-pyrazol-5-amine
Type:
Small Organic Molecule
Emp. Form.:
C21H17ClN4O2S
Mol. Mass.:
424.903
SMILES:
COc1ccccc1C(=O)n1nc(cc1NCc1ccc(Cl)s1)-c1ccccn1
: