Target
Apoptosis regulator Bcl-2/Glutathione S-transferase P
Ligand
BDBM185606
Substrate
Meas. Tech.
Time Resolved-Fluorescence Resonance Energy Transfer (TR-FRET) Assay
Temperature
298.15±n/a K
Ki
37.859±n/a nM
Comments
extracted
Citation
 Kunzer, ARElmore, SWSullivan, GM Apoptosis-inducing agent for the treatment of cancer and immune and autoimmune diseases US Patent  US9493431 Publication Date 11/15/2016 
Target
Name:
Apoptosis regulator Bcl-2/Glutathione S-transferase P
Synonyms:
GST-Bcl-2 Protein
Type:
Protein
Mol. Mass.:
Description:
Components:
This complex has 2 components.
Component 1
Name:
Apoptosis regulator Bcl-2
Synonyms:
Apoptosis regulator Bcl-2 Protein BCL-2 BCL2_HUMAN | Bcl-2 Protein
Type:
Homodimer or heterodimer
Mol. Mass.:
26269.11
Organism:
Homo sapiens (Human)
Description:
P10415
Residue:
239
  
Component 2
Name:
Glutathione S-transferase P
Synonyms:
FAEES3 GST3 GSTP1-1 Glutathione S-transferase Glutathione S-transferase P Glutathione transferase (GST)
Type:
Enzyme
Mol. Mass.:
23353.53
Organism:
Homo sapiens (Human)
Description:
P09211
Residue:
210
  
Inhibitor
Name:
BDBM185606
Synonyms:
US9156856, 16 | US9493431, 16
Type:
Small organic molecule
Emp. Form.:
C35H29ClF3N3O3S2
Mol. Mass.:
696.201
SMILES:
FC(F)(F)c1scc(c1-c1ccccc1)S(=O)(=O)NC(=O)c1ccc(cc1)N1CCN(Cc2ccccc2-c2ccc(Cl)cc2)CC1
: