Target
ATP-sensitive inward rectifier potassium channel 1
Ligand
BDBM254098
Substrate
Meas. Tech.
Thallium Flux Assay
Temperature
310.15±n/a K
IC50
91±n/a nM
Comments
extracted
Citation
 Walsh, SPPasternak, AShi, ZCato, BKim, EY Inhibitors of the renal outer medullary potassium channel US Patent  US9493474 Publication Date 11/15/2016 
Target
Name:
ATP-sensitive inward rectifier potassium channel 1
Synonyms:
ATP-regulated potassium channel ROM-K ATP-sensitive inward rectifier potassium channel 1 KCNJ1 Potassium channel (ATP modulatory) ROMK1 The Renal Outer Medullary Potassium (ROMK)
Type:
Enzyme Catalytic Domain
Mol. Mass.:
44809.08
Organism:
Homo sapiens (Human)
Description:
gi_223460826
Residue:
391
  
Inhibitor
Name:
BDBM254098
Synonyms:
US9493474, 11B
Type:
Small organic molecule
Emp. Form.:
C26H30N4O4
Mol. Mass.:
462.5408
SMILES:
CC1CC2CN(CC(O)c3ccc(cn3)C#N)CC2N1C[C@@H](O)c1ccc2C(=O)OCc2c1C
: