Target
ATP-sensitive inward rectifier potassium channel 1
Ligand
BDBM254084
Substrate
Meas. Tech.
Thallium Flux Assay
Temperature
310.15±n/a K
IC50
602.2±n/a nM
Comments
extracted
Citation
 Walsh, SPPasternak, AShi, ZCato, BKim, EY Inhibitors of the renal outer medullary potassium channel US Patent  US9493474 Publication Date 11/15/2016 
Target
Name:
ATP-sensitive inward rectifier potassium channel 1
Synonyms:
ATP-regulated potassium channel ROM-K ATP-sensitive inward rectifier potassium channel 1 KCNJ1 Potassium channel (ATP modulatory) ROMK1 The Renal Outer Medullary Potassium (ROMK)
Type:
Enzyme Catalytic Domain
Mol. Mass.:
44809.08
Organism:
Homo sapiens (Human)
Description:
gi_223460826
Residue:
391
  
Inhibitor
Name:
BDBM254084
Synonyms:
US9493474, 16
Type:
Small organic molecule
Emp. Form.:
C24H25N7O4
Mol. Mass.:
475.4998
SMILES:
Cc1c2COC(=O)c2ccc1[C@@H](O)CN1CCC2CN(CC12)C(=O)c1ccc(cn1)-n1cnnn1
: