Target
Beta-secretase 1
Ligand
BDBM136550
Substrate
Meas. Tech.
End Point Electrochemiluminescence (ECL) Assay
pH
6.5±n/a
IC50
24±n/a nM
Comments
extracted
Citation
 Stachel, SJCoburn, CASteele, TGWu, H Spiropyrrolidine beta-secretase inhibitors for the treatment of alzheimer's disease US Patent  US9505739 Publication Date 11/29/2016 
Target
Name:
Beta-secretase 1
Synonyms:
ASP2 Aspartyl protease 2 BACE1 Beta-secretase (BACE) Beta-secretase 1 (BACE 1) Beta-secretase 1 (BACE1) Beta-site amyloid precursor protein cleaving enzyme 1 Memapsin-2 beta-Secretase (BACE-1) | beta-Secretase (BACE1)
Type:
Protein
Mol. Mass.:
55755.10
Organism:
Homo sapiens (Human)
Description:
P56817
Residue:
501
  
Inhibitor
Name:
BDBM136550
Synonyms:
US8865701, 31 | US9505739, 31
Type:
Small organic molecule
Emp. Form.:
C28H36N2O
Mol. Mass.:
416.5982
SMILES:
CC(C)c1cccc2c1CCC[C@]21CNC[C@H]1C(=O)N1CCC(CC1)c1ccccc1
: