Target
P2X purinoceptor 7
Ligand
BDBM254266
Substrate
Meas. Tech.
Radioligand Binding Assay
Ki
9.4±n/a nM
Citation
 Alcazar Vaca, MJAndres Gil, JIChrovian, CCCoate, HRDe Angelis, MDvorak, CAGelin, CFLetavic, MASavall, BMSoyode-Johnson, AStenne, BMSwanson, DM P2X7 modulators US Patent  US9464084 Publication Date 10/11/2016 
Target
Name:
P2X purinoceptor 7
Synonyms:
ATP receptor P2RX7_HUMAN P2X purinoceptor 7 (P2X7) P2Z receptor | Purinergic receptor
Type:
Protein
Mol. Mass.:
68602.85
Organism:
Homo sapiens (Human)
Description:
Q99572
Residue:
595
  
Inhibitor
Name:
BDBM254266
Synonyms:
US10112937, Example 158 US10703749, Example 158 | US9464084, 158
Type:
Small organic molecule
Emp. Form.:
C18H13ClF4N6O
Mol. Mass.:
440.782
SMILES:
C[C@H]1N(CCc2c1nnn2-c1ncc(F)cn1)C(=O)c1cccc(c1Cl)C(F)(F)F
: