Target
P2X purinoceptor 7
Ligand
BDBM254306
Substrate
Meas. Tech.
Radioligand Binding Assay
Ki
7.9±n/a nM
Citation
 Alcazar Vaca, MJAndres Gil, JIChrovian, CCCoate, HRDe Angelis, MDvorak, CAGelin, CFLetavic, MASavall, BMSoyode-Johnson, AStenne, BMSwanson, DM P2X7 modulators US Patent  US9464084 Publication Date 10/11/2016 
Target
Name:
P2X purinoceptor 7
Synonyms:
ATP receptor P2RX7_HUMAN P2X purinoceptor 7 (P2X7) P2Z receptor | Purinergic receptor
Type:
Protein
Mol. Mass.:
68602.85
Organism:
Homo sapiens (Human)
Description:
Q99572
Residue:
595
  
Inhibitor
Name:
BDBM254306
Synonyms:
US10112937, Example 203 US10703749, Example 203 | US9464084, 203
Type:
Small organic molecule
Emp. Form.:
C17H13Cl2FN6O
Mol. Mass.:
407.229
SMILES:
CC1Cc2c(CN1C(=O)c1cccc(Cl)c1Cl)nnn2-c1ncc(F)cn1
: