Target
Glutathione S-transferase P/Lysine-specific histone demethylase 1A [158-852]
Ligand
BDBM254554
Substrate
Meas. Tech.
Biological Assay
pH
7.4±n/a
Temperature
310.15±n/a K
Ki
550±n/a nM
Comments
extracted
Citation
 Ortega Muñoz, AFyfe, MCMartinell Pedemonte, MEstiarte Martínez, MValls Vidal, NKurz, GCastro Palomino Laria, JC (Hetero)aryl cyclopropylamine compounds as LSD1 inhibitors US Patent  US9469597 Publication Date 10/18/2016 
Target
Name:
Glutathione S-transferase P/Lysine-specific histone demethylase 1A [158-852]
Synonyms:
GST-Lysine Specific Demethylase-1 (LSD1)
Type:
Enzyme
Mol. Mass.:
Description:
Components:
This complex has 2 components.
Component 1
Name:
Glutathione S-transferase P
Synonyms:
FAEES3 GST3 GSTP1-1 Glutathione S-transferase Glutathione S-transferase P Glutathione transferase (GST)
Type:
Enzyme
Mol. Mass.:
23353.53
Organism:
Homo sapiens (Human)
Description:
P09211
Residue:
210
  
Component 2
Name:
Lysine-specific histone demethylase 1A [158-852]
Synonyms:
AOF2 KDM1A KIAA0601 Lysine Specific Demethylase-1 (LSD1)
Type:
Enzyme
Mol. Mass.:
77140.81
Organism:
Homo sapiens (Human)
Description:
aa 158-852
Residue:
695
  
Inhibitor
Name:
BDBM254554
Synonyms:
US10214477, Example 13 US9670136, 13 N-(4-(((trans)-2-(6-(3-(trifluoromethyl)phenyl)pyridin-3-yl)cyclopropyl)amino)cyclohexyl)acetamide
Type:
Small organic molecule
Emp. Form.:
C23H26F3N3O
Mol. Mass.:
417.4672
SMILES:
CC(=O)NC1CCC(CC1)N[C@H]1C[C@@H]1c1ccc(nc1)-c1cccc(c1)C(F)(F)F
: