Target
Glucose-dependent insulinotropic receptor
Ligand
BDBM254653
Substrate
Meas. Tech.
AlphaScreen cAMP Assay
pH
7.4±n/a
Temperature
310.15±n/a K
EC50
84±n/a nM
Comments
extracted
Citation
 Nosse, BBlum, AHeckel, AHimmelsbach, FAshweek, NJHarriott, N N-cyclopropyl-N-piperidinyl-amides, pharmaceutical compositions containing them, and uses thereof US Patent  US9469631 Publication Date 10/18/2016 
Target
Name:
Glucose-dependent insulinotropic receptor
Synonyms:
G-protein coupled receptor 119 (GPR119) GPR119 | Glucose-dependent insulinotropic receptor
Type:
Protein
Mol. Mass.:
36901.49
Organism:
Homo sapiens (Human)
Description:
Q8TDV5
Residue:
335
  
Inhibitor
Name:
BDBM254653
Synonyms:
US9469631, 54
Type:
Small organic molecule
Emp. Form.:
C27H31N3O3
Mol. Mass.:
445.5533
SMILES:
CC(C)(C)OC(=O)N1CCC(CC1)N(C1CC1)C(=O)c1ccc(cc1)-c1ccc(cc1)C#N
: