Target
Toll-like receptor 8
Ligand
BDBM254775
Substrate
Meas. Tech.
Pharmacological Assay
EC50
17±n/a nM
Citation
 Hoves, SWang, LYun, HZhang, WZhu, W Benzazepine dicarboxamide compounds US Patent  US9475775 Publication Date 10/25/2016 
Target
Name:
Toll-like receptor 8
Synonyms:
CD_antigen: CD288 TLR8_HUMAN | TRL8
Type:
Enzyme
Mol. Mass.:
119828.77
Organism:
Homo sapiens (Human)
Description:
Q9NR97
Residue:
1041
  
Inhibitor
Name:
BDBM254775
Synonyms:
US9475775, 42 | US9597333, 42
Type:
Small organic molecule
Emp. Form.:
C27H34N4O2
Mol. Mass.:
446.5845
SMILES:
CCCCN(CCCC)C(=O)C1=Cc2ccc(cc2N=C(N)C1)C(=O)Nc1cccc(C)c1
: