Target
Toll-like receptor 7
Ligand
BDBM254786
Substrate
Meas. Tech.
Pharmacological Assay
EC50
20000±n/a nM
Citation
 Hoves, SWang, LYun, HZhang, WZhu, W Benzazepine dicarboxamide compounds US Patent  US9475775 Publication Date 10/25/2016 
Target
Name:
Toll-like receptor 7
Synonyms:
ORF Names:UNQ248/PRO285 TLR7_HUMAN | Toll-like receptor 7 (TLR7)
Type:
Enzyme
Mol. Mass.:
120945.35
Organism:
Homo sapiens (Human)
Description:
Q9NYK1
Residue:
1049
  
Inhibitor
Name:
BDBM254786
Synonyms:
US9475775, 53 | US9597333, 53
Type:
Small organic molecule
Emp. Form.:
C26H30N4O2
Mol. Mass.:
430.542
SMILES:
CCCN(CC1CC1)C(=O)C1=Cc2ccc(cc2N=C(N)C1)C(=O)Nc1cccc(C)c1
: