Target
Toll-like receptor 7
Ligand
BDBM254800
Substrate
Meas. Tech.
Pharmacological Assay
EC50
>100000±n/a nM
Citation
 Hoves, SWang, LYun, HZhang, WZhu, W Benzazepine dicarboxamide compounds US Patent  US9475775 Publication Date 10/25/2016 
Target
Name:
Toll-like receptor 7
Synonyms:
ORF Names:UNQ248/PRO285 TLR7_HUMAN | Toll-like receptor 7 (TLR7)
Type:
Enzyme
Mol. Mass.:
120945.35
Organism:
Homo sapiens (Human)
Description:
Q9NYK1
Residue:
1049
  
Inhibitor
Name:
BDBM254800
Synonyms:
US9475775, 67 | US9597333, 67
Type:
Small organic molecule
Emp. Form.:
C32H36N6O4
Mol. Mass.:
568.666
SMILES:
CCCN(CCC)C(=O)C1=Cc2ccc(cc2N=C(N)C1)C(=O)Nc1cncc(CNC(=O)OCc2ccccc2)c1
: