Target
Cyclin-dependent kinase 2/G1/S-specific cyclin-E1
Ligand
BDBM6682
Substrate
ING Peptide
Meas. Tech.
CDK Kinase Inhibition Assay
pH
7±n/a
Temperature
295.15±n/a K
IC50
214±n/a nM
Citation
 Jaramillo, Cde Diego, JEHamdouchi, CCollins, EKeyser, HSanchez-Martinez, Cdel Prado, MNorman, BBrooks, HBWatkins, SASpencer, CDDempsey, JAAnderson, BDCampbell, RMLeggett, TPatel, BSchultz, RMEspinosa, JVieth, MZhang, FTimm, DE Aminoimidazo[1,2-a]pyridines as a new structural class of cyclin-dependent kinase inhibitors. Part 1: Design, synthesis, and biological evaluation. Bioorg Med Chem Lett 14:6095-9 (2004)  
Target
Name:
Cyclin-dependent kinase 2/G1/S-specific cyclin-E1
Synonyms:
CDK2/CycE CDK2/E Cyclin-Dependent Kinase 2 (CDK2) Cyclin-dependent kinase 2/cyclin E1
Type:
Protein
Mol. Mass.:
Description:
Components:
This complex has 2 components.
Component 1
Name:
Cyclin-dependent kinase 2
Synonyms:
CDK2 CDK2_HUMAN Cell division protein kinase 2 Protein cereblon/Cyclin-dependent kinase 2 | p33 protein kinase
Type:
Enzyme Subunit
Mol. Mass.:
33938.17
Organism:
Homo sapiens (Human)
Description:
P24941
Residue:
298
  
Component 2
Name:
G1/S-specific cyclin-E1
Synonyms:
CCNE CCNE1_HUMAN
Type:
Enzyme Subunit
Mol. Mass.:
47073.17
Organism:
Homo sapiens (Human)
Description:
Residue:
410
  
Inhibitor
Name:
BDBM6682
Synonyms:
aminoimidazo[1,2-a]pyridine deriv. 17 | {2-amino-6-[(2,6-difluorophenyl)carbonyl]imidazo[1,2-a]pyridin-3-yl}(phenyl)methanethione
Type:
Small organic molecule
Emp. Form.:
C21H13F2N3OS
Mol. Mass.:
393.409
SMILES:
Nc1nc2ccc(cn2c1C(=S)c1ccccc1)C(=O)c1c(F)cccc1F
:
Substrate
Name:
ING Peptide
Synonyms:
Type:
Peptide
Mol. Mass.:
1341.50
Organism:
Description:
amino acid residues 246-257 from human retinoblastoma 1 protein.
Residue:
12
INGSPRTPRRGQ