Target
Endothelial lipase
Ligand
BDBM254859
Substrate
Meas. Tech.
Enzymatic Assay
pH
8±n/a
IC50
245.80±n/a nM
Comments
extracted
Citation
 Qiao, JXFinlay, HJiang, JLloyd, JHu, CHPi, ZTora, GONeels, JHangeland, JJFriends, TJ Pyrrolinone carboxamide compounds useful as endothelial lipase inhibitors US Patent  US9493412 Publication Date 11/15/2016 
Target
Name:
Endothelial lipase
Synonyms:
EDL Endothelial cell-derived lipase LIPG
Type:
Protein
Mol. Mass.:
56805.62
Organism:
Homo sapiens (Human)
Description:
Q9Y5X9
Residue:
500
  
Inhibitor
Name:
BDBM254859
Synonyms:
US9493412, 92
Type:
Small organic molecule
Emp. Form.:
C20H19FN2O3
Mol. Mass.:
354.3749
SMILES:
C[C@@H](NC(=O)C1=C(O)C(=O)N(C)C1)c1cccc(c1)-c1cccc(F)c1
: