Target
Tyrosine-protein kinase JAK1
Ligand
BDBM254985
Substrate
Meas. Tech.
Enzyme Assay
IC50
3.2±n/a nM
Citation
 Takahashi, KWatanabe, THayashi, KKurihara, KNakamura, TYamamoto, ANishimura, TKamiyama, THidaka, Y Tricyclic pyrrolopyridine compound, and JAK inhibitor US Patent  US9475813 Publication Date 10/25/2016 
Target
Name:
Tyrosine-protein kinase JAK1
Synonyms:
JAK-1 JAK1A JAK1_HUMAN Janus kinase 1 (JAK1) | Janus kinase 1 JAK1
Type:
Protein
Mol. Mass.:
133293.73
Organism:
Homo sapiens (Human)
Description:
P23458
Residue:
1154
  
Inhibitor
Name:
BDBM254985
Synonyms:
US9475813, 41
Type:
Small organic molecule
Emp. Form.:
C21H28F3N5O2
Mol. Mass.:
439.4745
SMILES:
COCN1CN([C@H]2CC[C@H](CN(C)CC(F)(F)F)CC2)c2c(cnc3[nH]ccc23)C1=O
: