Target
Casein kinase I isoform epsilon
Ligand
BDBM255069
Substrate
Meas. Tech.
Kinase Assay
pH
7.4±n/a
Temperature
298.15±n/a K
IC50
20±n/a nM
Comments
extracted
Citation
 Velaparthi, UDarne, CPDodd, DSLiu, PMussari, CPWittman, MDKumaravel, SMullick, D Pyrazole substituted imidazopyrazines as casein kinase 1 d/e inhibitors US Patent  US9475817 Publication Date 10/25/2016 
Target
Name:
Casein kinase I isoform epsilon
Synonyms:
Axin-1/Casein kinase I epsilon CKIe Casein kinase 1 epsilon (CK1Ɛ) Casein kinase I isoform epsilon (CK1 epsilon) Casein kinase I isoform epsilon (CK1epsilon) | KC1E_HUMAN
Type:
Protein
Mol. Mass.:
47340.25
Organism:
Homo sapiens (Human)
Description:
P49674
Residue:
416
  
Inhibitor
Name:
BDBM255069
Synonyms:
US9475817, 26
Type:
Small organic molecule
Emp. Form.:
C26H24FN7O
Mol. Mass.:
469.5135
SMILES:
CN(C)Cc1cccc(c1)C(=O)Nc1cn2nc(ccc2n1)-c1cn(C)nc1-c1ccc(F)cc1
: