Target
Casein kinase I isoform epsilon
Ligand
BDBM255199
Substrate
Meas. Tech.
Kinase Assay
pH
7.4±n/a
Temperature
298.15±n/a K
IC50
0.3±n/a nM
Comments
extracted
Citation
 Velaparthi, UDarne, CPDodd, DSLiu, PMussari, CPWittman, MDKumaravel, SMullick, D Pyrazole substituted imidazopyrazines as casein kinase 1 d/e inhibitors US Patent  US9475817 Publication Date 10/25/2016 
Target
Name:
Casein kinase I isoform epsilon
Synonyms:
Axin-1/Casein kinase I epsilon CKIe Casein kinase 1 epsilon (CK1Ɛ) Casein kinase I isoform epsilon (CK1 epsilon) Casein kinase I isoform epsilon (CK1epsilon) | KC1E_HUMAN
Type:
Protein
Mol. Mass.:
47340.25
Organism:
Homo sapiens (Human)
Description:
P49674
Residue:
416
  
Inhibitor
Name:
BDBM255199
Synonyms:
US9475817, 158
Type:
Small organic molecule
Emp. Form.:
C30H27F5N8O2
Mol. Mass.:
626.5798
SMILES:
Cn1nc(c(c1C1CCN(C[C@@H](O)C(F)(F)F)CC1)-c1ccc2nc(NC(=O)c3ccnc(F)c3)cn2n1)-c1ccc(F)cc1
: