Target
Casein kinase I isoform delta
Ligand
BDBM255063
Substrate
Meas. Tech.
Kinase Assay
pH
7.4±n/a
Temperature
298.15±n/a K
IC50
4.3±n/a nM
Comments
extracted
Citation
 Velaparthi, UDarne, CPDodd, DSLiu, PMussari, CPWittman, MDKumaravel, SMullick, D Pyrazole substituted imidazopyrazines as casein kinase 1 d/e inhibitors US Patent  US9475817 Publication Date 10/25/2016 
Target
Name:
Casein kinase I isoform delta
Synonyms:
CKI-delta CSNK1D Casein kinase I delta Casein kinase I isoform delta (CK1D) KC1D_HUMAN | casein kinases 1 delta (CK1 delta)
Type:
Enzyme
Mol. Mass.:
47356.76
Organism:
Homo sapiens (Human)
Description:
P48730
Residue:
415
  
Inhibitor
Name:
BDBM255063
Synonyms:
US9475817, 20
Type:
Small organic molecule
Emp. Form.:
C23H16F2N6O
Mol. Mass.:
430.4095
SMILES:
Cn1cc(c(n1)-c1ccc(F)cc1)-c1ccc2nc(NC(=O)c3ccccc3F)cn2n1
: