Target
Orexin/Hypocretin receptor type 1
Ligand
BDBM163958
Substrate
Meas. Tech.
Radioligand Binding Assay
Temperature
277.15±n/a K
Ki
11±n/a nM
Comments
extracted
Citation
 Coate, HRDvorak, CALebold, TPPreville, CShireman, BT Substituted 7-azabicycles and their use as orexin receptor modulators US Patent  US9475819 Publication Date 10/25/2016 
Target
Name:
Orexin/Hypocretin receptor type 1
Synonyms:
Hcrtr1 OX1R_RAT Orexin receptor type 1 (OX1R) Ox1-R | Ox1R
Type:
Protein
Mol. Mass.:
46817.55
Organism:
Rattus norvegicus (Rat)
Description:
P56718
Residue:
416
  
Inhibitor
Name:
BDBM163958
Synonyms:
US9062078, 89 US9637496, 89 | US9695183, 89
Type:
Small organic molecule
Emp. Form.:
C25H26N2O3
Mol. Mass.:
402.4855
SMILES:
CCOc1ccc2ccccc2c1C(=O)N1C2CCC1C(COc1ccccn1)C2
: