Target
Orexin/Hypocretin receptor type 1
Ligand
BDBM163898
Substrate
Meas. Tech.
Radioligand Binding Assay
Temperature
277.15±n/a K
Ki
11±n/a nM
Comments
extracted
Citation
 Coate, HRDvorak, CALebold, TPPreville, CShireman, BT Substituted 7-azabicycles and their use as orexin receptor modulators US Patent  US9475819 Publication Date 10/25/2016 
Target
Name:
Orexin/Hypocretin receptor type 1
Synonyms:
HCRTR1 OX1R_HUMAN Orexin receptor type 1 (OR 1) Orexin receptor type 1 (OX1) Orexin receptor type 1 (OxR1) | Ox1r
Type:
Protein
Mol. Mass.:
47554.50
Organism:
Homo sapiens (Human)
Description:
O43613
Residue:
425
  
Inhibitor
Name:
BDBM163898
Synonyms:
US9062078, 29 US9637496, 29 | US9695183, 29
Type:
Small organic molecule
Emp. Form.:
C23H21F2N3O2S
Mol. Mass.:
441.494
SMILES:
Cc1nc(C(=O)N2C3CCC2C(COc2ccc(F)cn2)C3)c(s1)-c1ccccc1F
: