Target
Orexin/Hypocretin receptor type 1
Ligand
BDBM64946
Substrate
Meas. Tech.
Radioligand Binding Assay
Temperature
277.15±n/a K
Ki
7±n/a nM
Comments
extracted
Citation
 Coate, HRDvorak, CALebold, TPPreville, CShireman, BT Substituted 7-azabicycles and their use as orexin receptor modulators US Patent  US9475819 Publication Date 10/25/2016 
Target
Name:
Orexin/Hypocretin receptor type 1
Synonyms:
HCRTR1 OX1R_HUMAN Orexin receptor type 1 (OR 1) Orexin receptor type 1 (OX1) Orexin receptor type 1 (OxR1) | Ox1r
Type:
Protein
Mol. Mass.:
47554.50
Organism:
Homo sapiens (Human)
Description:
O43613
Residue:
425
  
Inhibitor
Name:
BDBM64946
Synonyms:
US9475819, 164
Type:
Emp. Form.:
C24H25N3O3
Mol. Mass.:
403.4736
SMILES:
CCOc1ncc2ccccc2c1C(=O)N1[C@@H]2CC[C@H]1[C@H](COc1ccccn1)C2
: