Target
Tyrosine-protein kinase BTK
Ligand
BDBM255298
Substrate
Meas. Tech.
LANCE (Lanthanide Chelate Excite) TR-FRET (Time-resolved fluorescence resonance energy transfer) Assay
IC50
0.17±n/a nM
Citation
 Kim, RMLiu, JGao, XBoga, SBGuiadeen, DKozlowski, JAYu, WAnand, RYu, YSelyutin, OBGao, YWu, HLiu, SYang, CWang, H Substituted benzamides and substituted pyridinecarboxamides as Btk inhibitors US Patent  US9481682 Publication Date 11/1/2016 
Target
Name:
Tyrosine-protein kinase BTK
Synonyms:
AGMX1 Agammaglobulinaemia tyrosine kinase B cell progenitor kinase BPK BTK_HUMAN Tyrosine Kinase BTK Tyrosine-protein kinase BTK (BTK)
Type:
Enzyme
Mol. Mass.:
76289.95
Organism:
Homo sapiens (Human)
Description:
Q06187
Residue:
659
  
Inhibitor
Name:
BDBM255298
Synonyms:
US9481682, 47
Type:
Small organic molecule
Emp. Form.:
C29H29N7O3
Mol. Mass.:
523.5857
SMILES:
C[C@H]1OC(=O)N2C[C@@H](CC[C@@H]12)c1nc(-c2ccc(cc2)C(=O)Nc2cc(ccn2)C2CC2)c2c(N)nccn12
: