Target
Tyrosine-protein kinase SYK
Ligand
BDBM255517
Substrate
Meas. Tech.
Biochemical Assay
pH
7.4±n/a
Temperature
298.15±n/a K
IC50
267.8±n/a nM
Comments
extracted
Citation
 Singh, RArgade, APayan, DGMolineaux, SHolland, SJClough, JKeim, HBhamidipati, SSylvain, CLi, HRossi, AB 2,4-pyrimidinediamine compounds and their uses US Patent  US9499493 Publication Date 11/22/2016 
Target
Name:
Tyrosine-protein kinase SYK
Synonyms:
KSYK_HUMAN Spleen Tyrosine Kinase Tyrosine-protein kinase SYK (Syk)
Type:
Enzyme
Mol. Mass.:
72079.99
Organism:
Homo sapiens (Human)
Description:
P43405
Residue:
635
  
Inhibitor
Name:
BDBM255517
Synonyms:
N2,N4-Bis(3-aminophenyl)-5-fluoro-2,4-pyrimidinediamine | US9499493, R921302
Type:
Small organic molecule
Emp. Form.:
C28H25FN8
Mol. Mass.:
492.5501
SMILES:
Nc1cccc(c1)N(c1cccc(N)c1)c1ncc(F)c(n1)N(c1cccc(N)c1)c1cccc(N)c1
: